Reaction Details
TargetPotassium voltage-gated channel subfamily H member 2
LigandBDBM50235196
Substrate/Competitorn/a
Meas. Tech.ChEMBL_1654946 (CHEMBL4004312)
IC50 8900±n/a nM
Citation Chobanian, HRGuo, YPio, BTang, HTeumelsan, NClements, MFrie, JFerguson, RGuo, ZThomas-Fowlkes, BSFelix, JPLiu, JKohler, MPriest, BHampton, CPai, LYCorona, AMetzger, JTong, VJoshi, EMXu, LOwens, KMaloney, KSullivan, KPasternak, A The design and synthesis of novel spirocyclic heterocyclic sulfone ROMK inhibitors as diuretics. Bioorg Med Chem Lett27:1109-1114 (2017) 
 
Potassium voltage-gated channel subfamily H member 2
Name:Potassium voltage-gated channel subfamily H member 2
Type:Multi-pass membrane protein
Mol. Mass.:126672.65
Organism:Homo sapiens (Human)
Description:Q12809
Residue:1159
BDBM50235196
NameBDBM50235196
Synonyms:CHEMBL4064760
TypeSmall organic molecule
Emp. Form.C24H30N4O5S
Mol. Mass.486.584
SMILESCc1c2COC(=O)c2ccc1[C@@H](O)CN1CCC2(CCN(C2)c2cnc(cn2)S(C)(=O)=O)CC1