Reaction Details
TargetPolymerase acidic protein
LigandBDBM50385503
Substrate/Competitorn/a
Meas. Tech.ChEMBL_1658602 (CHEMBL4008214)
IC50 320±n/a nM
Citation Ju, HZhang, JHuang, BKang, DHuang, BLiu, XZhan, P Inhibitors of Influenza Virus Polymerase Acidic (PA) Endonuclease: Contemporary Developments and Perspectives. J Med Chem60:3533-3551 (2017) 
 
Polymerase acidic protein
Name:Polymerase acidic protein
Type:PROTEIN
Mol. Mass.:82573.84
Organism:Hepatitis C virus
Description:ChEMBL_64976
Residue:716
BDBM50385503
NameBDBM50385503
Synonyms:CHEMBL2040554
TypeSmall organic molecule
Emp. Form.C23H30ClNO4
Mol. Mass.419.942
SMILESOC(=O)C(=O)CC(=O)C1(Cc2ccc(Cl)cc2)CCN(CC2CCCCC2)CC1