Reaction Details
TargetPolymerase acidic protein
LigandBDBM50385529
Substrate/Competitorn/a
Meas. Tech.ChEMBL_1658602 (CHEMBL4008214)
IC50 1100±n/a nM
Citation Ju, HZhang, JHuang, BKang, DHuang, BLiu, XZhan, P Inhibitors of Influenza Virus Polymerase Acidic (PA) Endonuclease: Contemporary Developments and Perspectives. J Med Chem60:3533-3551 (2017) 
 
Polymerase acidic protein
Name:Polymerase acidic protein
Type:PROTEIN
Mol. Mass.:82573.84
Organism:Hepatitis C virus
Description:ChEMBL_64976
Residue:716
BDBM50385529
NameBDBM50385529
Synonyms:CHEMBL2040587
TypeSmall organic molecule
Emp. Form.C23H24ClNO4
Mol. Mass.413.894
SMILESOC(=O)C(=O)CC(=O)C1(Cc2ccc(Cl)cc2)CCCN(Cc2ccccc2)C1