Reaction Details
TargetPolymerase acidic protein
LigandBDBM50385534
Substrate/Competitorn/a
Meas. Tech.ChEMBL_1658603 (CHEMBL4008215)
IC50 2800±n/a nM
Citation Ju, HZhang, JHuang, BKang, DHuang, BLiu, XZhan, P Inhibitors of Influenza Virus Polymerase Acidic (PA) Endonuclease: Contemporary Developments and Perspectives. J Med Chem60:3533-3551 (2017) 
 
Polymerase acidic protein
Name:Polymerase acidic protein
Type:PROTEIN
Mol. Mass.:82573.84
Organism:Hepatitis C virus
Description:ChEMBL_64976
Residue:716
BDBM50385534
NameBDBM50385534
Synonyms:CHEMBL2040605
TypeSmall organic molecule
Emp. Form.C19H16N2O4
Mol. Mass.336.3413
SMILESCOc1ccc(C=c2[nH]c(=Cc3ccccc3)c(=O)n(O)c2=O)cc1