Reaction Details
TargetComplement factor D
LigandBDBM50236213
Substrate/Competitorn/a
Meas. Tech.ChEMBL_1658835 (CHEMBL4008447)
Kd 500000±n/a nM
Citation Vulpetti, ARandl, SRüdisser, SOstermann, NErbel, PMac Sweeney, AZoller, TSalem, BGerhartz, BCumin, FHommel, UDalvit, CLorthiois, EMaibaum, J Structure-Based Library Design and Fragment Screening for the Identification of Reversible Complement Factor D Protease Inhibitors. J Med Chem60:1946-1958 (2017) 
 
Complement factor D
Name:Complement factor D
Type:Protein
Mol. Mass.:27039.19
Organism:Homo sapiens (Human)
Description:P00746
Residue:253
BDBM50236213
NameBDBM50236213
Synonyms:2-(3-Benzylureido)Benzoic Acid | CHEMBL561499
TypeSmall organic molecule
Emp. Form.C15H14N2O3
Mol. Mass.270.2833
SMILESOC(=O)c1ccccc1NC(=O)NCc1ccccc1