Reaction Details
TargetLeukotriene A-4 hydrolase
LigandBDBM50005711
Substrate/Competitorn/a
Meas. Tech.ChEMBL_1659614 (CHEMBL4009226)
IC50>10000±n/a nM
Citation Lu, WYao, XOuyang, PDong, NWu, DJiang, XWu, ZZhang, CXu, ZTang, YZou, SLiu, MLi, JZeng, MLin, PCheng, FHuang, J Drug Repurposing of Histone Deacetylase Inhibitors That Alleviate Neutrophilic Inflammation in Acute Lung Injury and Idiopathic Pulmonary Fibrosis via Inhibiting Leukotriene A4 Hydrolase and Blocking LTB4 Biosynthesis. J Med Chem60:1817-1828 (2017) 
 
Leukotriene A-4 hydrolase
Name:Leukotriene A-4 hydrolase
Type:Hydrolase; metalloprotease
Mol. Mass.:69280.41
Organism:Homo sapiens (Human)
Description:Human recombinant LTA4H.
Residue:611
BDBM50005711
NameBDBM50005711
Synonyms:CHEBI:46024 TRICHOSTATIN Trichostatin A (TSA) US10722597, Compound Trichostatin US20230322747, Compound trichostatin A | US9265734, TSA
TypeSmall organic molecule
Emp. Form.C17H22N2O3
Mol. Mass.302.3682
SMILESC[C@H](\C=C(/C)\C=C\C(=O)NO)C(=O)c1ccc(cc1)N(C)C