Reaction Details
TargetTransmembrane protease serine 6
LigandBDBM50236915
Substrate/Competitorn/a
Meas. Tech.ChEMBL_1659751 (CHEMBL4009363)
Ki 2.1±n/a nM
Citation St-Georges, CDésilets, ABéliveau, FGhinet, MDion, SPColombo, ÉBoudreault, PLNajmanovich, RJLeduc, RMarsault, É Modulating the selectivity of matriptase-2 inhibitors with unnatural amino acids. Eur J Med Chem129:110-123 (2017) 
 
Transmembrane protease serine 6
Name:Transmembrane protease serine 6
Type:PROTEIN
Mol. Mass.:90001.12
Organism:Homo sapiens (Human)
Description:ChEMBL_1442547
Residue:811
BDBM50236915
NameBDBM50236915
Synonyms:CHEMBL4100506
TypeSmall organic molecule
Emp. Form.C37H45N7O4S
Mol. Mass.683.863
SMILESCC(C)[C@H](NC(=O)[C@H](CCc1ccccc1)NC(=O)CCc1ccccc1)C(=O)N[C@@H](CCCNC(N)=N)C(=O)c1nc2ccccc2s1