Reaction Details
TargetTransmembrane protease serine 6
LigandBDBM50236922
Substrate/Competitorn/a
Meas. Tech.ChEMBL_1659751 (CHEMBL4009363)
Ki 5.0±n/a nM
Citation St-Georges, CDésilets, ABéliveau, FGhinet, MDion, SPColombo, ÉBoudreault, PLNajmanovich, RJLeduc, RMarsault, É Modulating the selectivity of matriptase-2 inhibitors with unnatural amino acids. Eur J Med Chem129:110-123 (2017) 
 
Transmembrane protease serine 6
Name:Transmembrane protease serine 6
Type:PROTEIN
Mol. Mass.:90001.12
Organism:Homo sapiens (Human)
Description:ChEMBL_1442547
Residue:811
BDBM50236922
NameBDBM50236922
Synonyms:CHEMBL4089262
TypeSmall organic molecule
Emp. Form.C40H44N8O8S
Mol. Mass.796.891
SMILESN[C@@H](Cc1ccc(O)cc1)C(=O)N[C@@H](Cc1ccc(O)cc1)C(=O)N[C@@H](Cc1ccc(O)c(O)c1)C(=O)N[C@@H](CCCNC(N)=N)C(=O)c1nc2ccccc2s1