Reaction Details
TargetTransmembrane protease serine 6
LigandBDBM50236938
Substrate/Competitorn/a
Meas. Tech.ChEMBL_1659751 (CHEMBL4009363)
Ki 3.1±n/a nM
Citation St-Georges, CDésilets, ABéliveau, FGhinet, MDion, SPColombo, ÉBoudreault, PLNajmanovich, RJLeduc, RMarsault, É Modulating the selectivity of matriptase-2 inhibitors with unnatural amino acids. Eur J Med Chem129:110-123 (2017) 
 
Transmembrane protease serine 6
Name:Transmembrane protease serine 6
Type:PROTEIN
Mol. Mass.:90001.12
Organism:Homo sapiens (Human)
Description:ChEMBL_1442547
Residue:811
BDBM50236938
NameBDBM50236938
Synonyms:CHEMBL4086405
TypeSmall organic molecule
Emp. Form.C36H43N7O5S
Mol. Mass.685.836
SMILESC[C@H](O)[C@H](NC(=O)[C@H](CCc1ccccc1)NC(=O)CCc1ccccc1)C(=O)N[C@@H](CCCNC(N)=N)C(=O)c1nc2ccccc2s1