Reaction Details
TargetSolute carrier family 22 member 1
LigandBDBM50225293
Substrate/Competitorn/a
Meas. Tech.ChEBML_1659987
IC50 4850±n/a nM
Citation Chen, ECKhuri, NLiang, XStecula, AChien, HCYee, SWHuang, YSali, AGiacomini, KM Discovery of Competitive and Noncompetitive Ligands of the Organic Cation Transporter 1 (OCT1; SLC22A1). J Med Chem60:2685-2696 (2017) 
 
Solute carrier family 22 member 1
Name:Solute carrier family 22 member 1
Type:Enzyme Catalytic Domain
Mol. Mass.:61154.85
Organism:Homo sapiens (Human)
Description:Adrenergic Alpha 0 HUMAN::O15245
Residue:554
BDBM50225293
NameBDBM50225293
Synonyms:CHEBI:5553 WY-8678
TypeSmall organic molecule
Emp. Form.C8H8Cl2N4
Mol. Mass.231.082
SMILESNC(=N)N\N=C\c1c(Cl)cccc1Cl