Reaction Details
TargetSolute carrier family 22 member 1
LigandBDBM31774
Substrate/Competitorn/a
Meas. Tech.ChEMBL_1659985 (CHEMBL4009597)
IC50 11970±n/a nM
Citation Chen, ECKhuri, NLiang, XStecula, AChien, HCYee, SWHuang, YSali, AGiacomini, KM Discovery of Competitive and Noncompetitive Ligands of the Organic Cation Transporter 1 (OCT1; SLC22A1). J Med Chem60:2685-2696 (2017) 
 
Solute carrier family 22 member 1
Name:Solute carrier family 22 member 1
Type:Enzyme Catalytic Domain
Mol. Mass.:61154.85
Organism:Homo sapiens (Human)
Description:Adrenergic Alpha 0 HUMAN::O15245
Residue:554
BDBM31774
NameBDBM31774
Synonyms:CHEMBL104 Clotrimazole Mycelex cid_2812
TypeSmall organic molecule
Emp. Form.C22H17ClN2
Mol. Mass.344.837
SMILESClc1ccccc1C(c1ccccc1)(c1ccccc1)n1ccnc1