Reaction Details
Target[Pyruvate dehydrogenase (acetyl-transferring)] kinase isozyme 1, mitochondrial
LigandBDBM50237379
Substrate/Competitorn/a
Meas. Tech.ChEMBL_1660037 (CHEMBL4009649)
Ki 3340±n/a nM
Citation Liu, YXie, ZZhao, DZhu, JMao, FTang, SXu, HLuo, CGeng, MHuang, MLi, J Development of the First Generation of Disulfide-Based Subtype-Selective and Potent Covalent Pyruvate Dehydrogenase Kinase 1 (PDK1) Inhibitors. J Med Chem60:2227-2244 (2017) 
 
[Pyruvate dehydrogenase (acetyl-transferring)] kinase isozyme 1, mitochondrial
Name:[Pyruvate dehydrogenase (acetyl-transferring)] kinase isozyme 1, mitochondrial
Type:Protein
Mol. Mass.:49255.23
Organism:Homo sapiens (Human)
Description:Q15118
Residue:436
BDBM50237379
NameBDBM50237379
Synonyms:CHEMBL4070900
TypeSmall organic molecule
Emp. Form.C18H16N2O2S4
Mol. Mass.420.592
SMILESS=C(SSC(=S)N1CCOc2ccccc12)N1CCOc2ccccc12