Reaction Details
TargetCytochrome P450 2C19
LigandBDBM50317425
Substrate/Competitorn/a
Meas. Tech.ChEMBL_1661016 (CHEMBL4010628)
IC50 13600±n/a nM
Citation Kim, HJKim, ISRehman, SUHa, SKNakamura, KYoo, HH Effects of 6-paradol, an unsaturated ketone from gingers, on cytochrome P450-mediated drug metabolism. Bioorg Med Chem Lett27:1826-1830 (2017) 
 
Cytochrome P450 2C19
Name:Cytochrome P450 2C19
Type:Enzyme
Mol. Mass.:55935.47
Organism:Homo sapiens (Human)
Description:P33261
Residue:490
BDBM50317425
NameBDBM50317425
Synonyms:10-Gingerol | CHEMBL549472
TypeSmall organic molecule
Emp. Form.C21H34O4
Mol. Mass.350.4923
SMILESCCCCCCCCC[C@H](O)CC(=O)CCc1ccc(O)c(OC)c1