Reaction Details
TargetSodium-dependent dopamine transporter
LigandBDBM50389125
Substrate/Competitorn/a
Meas. Tech.ChEMBL_1661728 (CHEMBL4011340)
EC50 70±n/a nM
Citation Tosh, DKJanowsky, AEshleman, AJWarnick, EGao, ZGChen, ZGizewski, EAuchampach, JASalvemini, DJacobson, KA Scaffold Repurposing of Nucleosides (Adenosine Receptor Agonists): Enhanced Activity at the Human Dopamine and Norepinephrine Sodium Symporters. J Med Chem60:3109-3123 (2017) 
 
Sodium-dependent dopamine transporter
Name:Sodium-dependent dopamine transporter
Type:Multi-pass membrane protein
Mol. Mass.:68497.11
Organism:Homo sapiens (Human)
Description:Q01959
Residue:620
BDBM50389125
NameBDBM50389125
Synonyms:CHEMBL2064645
TypeSmall organic molecule
Emp. Form.C22H20F2N6O3
Mol. Mass.454.4294
SMILESCNC(=O)[C@@]12C[C@@H]1[C@H]([C@H](O)[C@@H]2O)n1cnc2c(NC)nc(nc12)C#Cc1ccc(F)c(F)c1