Reaction Details
TargetSodium-dependent serotonin transporter
LigandBDBM50389125
Substrate/Competitorn/a
Meas. Tech.ChEMBL_1661734 (CHEMBL4011346)
EC50>10000±n/a nM
Citation Tosh, DKJanowsky, AEshleman, AJWarnick, EGao, ZGChen, ZGizewski, EAuchampach, JASalvemini, DJacobson, KA Scaffold Repurposing of Nucleosides (Adenosine Receptor Agonists): Enhanced Activity at the Human Dopamine and Norepinephrine Sodium Symporters. J Med Chem60:3109-3123 (2017) 
 
Sodium-dependent serotonin transporter
Name:Sodium-dependent serotonin transporter
Type:Multi-pass membrane protein
Mol. Mass.:70322.51
Organism:Homo sapiens (Human)
Description:P31645
Residue:630
BDBM50389125
NameBDBM50389125
Synonyms:CHEMBL2064645
TypeSmall organic molecule
Emp. Form.C22H20F2N6O3
Mol. Mass.454.4294
SMILESCNC(=O)[C@@]12C[C@@H]1[C@H]([C@H](O)[C@@H]2O)n1cnc2c(NC)nc(nc12)C#Cc1ccc(F)c(F)c1