Reaction Details
TargetSodium-dependent noradrenaline transporter
LigandBDBM50236726
Substrate/Competitorn/a
Meas. Tech.ChEMBL_1661732 (CHEMBL4011344)
EC50>10000±n/a nM
Citation Tosh, DKJanowsky, AEshleman, AJWarnick, EGao, ZGChen, ZGizewski, EAuchampach, JASalvemini, DJacobson, KA Scaffold Repurposing of Nucleosides (Adenosine Receptor Agonists): Enhanced Activity at the Human Dopamine and Norepinephrine Sodium Symporters. J Med Chem60:3109-3123 (2017) 
 
Sodium-dependent noradrenaline transporter
Name:Sodium-dependent noradrenaline transporter
Type:Multi-pass membrane protein
Mol. Mass.:69337.72
Organism:Homo sapiens (Human)
Description:P23975
Residue:617
BDBM50236726
NameBDBM50236726
Synonyms:CHEMBL4092411
TypeSmall organic molecule
Emp. Form.C18H16ClN5O5S
Mol. Mass.449.868
SMILESCNc1nc(nc2n(cnc12)[C@@H]1O[C@@H]([C@@H](O)[C@H]1O)C(=O)OC)C#Cc1ccc(Cl)s1