Reaction Details
TargetSodium-dependent noradrenaline transporter
LigandBDBM50389125
Substrate/Competitorn/a
Meas. Tech.ChEMBL_1661730 (CHEMBL4011342)
EC50 1760±n/a nM
Citation Tosh, DKJanowsky, AEshleman, AJWarnick, EGao, ZGChen, ZGizewski, EAuchampach, JASalvemini, DJacobson, KA Scaffold Repurposing of Nucleosides (Adenosine Receptor Agonists): Enhanced Activity at the Human Dopamine and Norepinephrine Sodium Symporters. J Med Chem60:3109-3123 (2017) 
 
Sodium-dependent noradrenaline transporter
Name:Sodium-dependent noradrenaline transporter
Type:Multi-pass membrane protein
Mol. Mass.:69337.72
Organism:Homo sapiens (Human)
Description:P23975
Residue:617
BDBM50389125
NameBDBM50389125
Synonyms:CHEMBL2064645
TypeSmall organic molecule
Emp. Form.C22H20F2N6O3
Mol. Mass.454.4294
SMILESCNC(=O)[C@@]12C[C@@H]1[C@H]([C@H](O)[C@@H]2O)n1cnc2c(NC)nc(nc12)C#Cc1ccc(F)c(F)c1