Reaction Details
TargetIntestinal-type alkaline phosphatase
LigandBDBM50237918
Substrate/Competitorn/a
Meas. Tech.ChEMBL_1662570 (CHEMBL4012251)
IC50 2720±n/a nM
Citation Salar, UKhan, KMIqbal, JEjaz, SAHameed, AAl-Rashida, MPerveen, STahir, MN Coumarin sulfonates: New alkaline phosphatase inhibitors; in vitro and in silico studies. Eur J Med Chem131:29-47 (2017) 
 
Intestinal-type alkaline phosphatase
Name:Intestinal-type alkaline phosphatase
Type:PROTEIN
Mol. Mass.:56804.94
Organism:Homo sapiens (Human)
Description:ChEMBL_1278525
Residue:528
BDBM50237918
NameBDBM50237918
Synonyms:CHEMBL4093867
TypeSmall organic molecule
Emp. Form.C16H10ClNO7S
Mol. Mass.395.771
SMILESCc1cc(=O)oc2cc(OS(=O)(=O)c3ccc(Cl)c(c3)[N+]([O-])=O)ccc12