Reaction Details
TargetIntestinal-type alkaline phosphatase
LigandBDBM50237917
Substrate/Competitorn/a
Meas. Tech.ChEMBL_1662570 (CHEMBL4012251)
IC50 4060±n/a nM
Citation Salar, UKhan, KMIqbal, JEjaz, SAHameed, AAl-Rashida, MPerveen, STahir, MN Coumarin sulfonates: New alkaline phosphatase inhibitors; in vitro and in silico studies. Eur J Med Chem131:29-47 (2017) 
 
Intestinal-type alkaline phosphatase
Name:Intestinal-type alkaline phosphatase
Type:PROTEIN
Mol. Mass.:56804.94
Organism:Homo sapiens (Human)
Description:ChEMBL_1278525
Residue:528
BDBM50237917
NameBDBM50237917
Synonyms:CHEMBL4059741
TypeSmall organic molecule
Emp. Form.C13H11NO5S
Mol. Mass.293.295
SMILESCCS(=O)(=O)Oc1ccc2c(C)c(C#N)c(=O)oc2c1