Reaction Details
TargetKynurenine 3-monooxygenase
LigandBDBM50237995
Substrate/Competitorn/a
Meas. Tech.ChEMBL_1662712 (CHEMBL4012393)
IC50 1259±n/a nM
Citation Liddle, JBeaufils, BBinnie, MBouillot, ADenis, AAHann, MMHaslam, CPHolmes, DSHutchinson, JPKranz, MMcBride, AMirguet, OMole, DJMowat, CGPal, SRowland, PTrottet, LUings, IJWalker, ALWebster, SP The discovery of potent and selective kynurenine 3-monooxygenase inhibitors for the treatment of acute pancreatitis. Bioorg Med Chem Lett27:2023-2028 (2017) 
 
Kynurenine 3-monooxygenase
Name:Kynurenine 3-monooxygenase
Type:PROTEIN
Mol. Mass.:55831.03
Organism:Homo sapiens (Human)
Description:ChEMBL_1487479
Residue:486
BDBM50237995
NameBDBM50237995
Synonyms:CHEMBL4096688
TypeSmall organic molecule
Emp. Form.C17H23ClN2O8
Mol. Mass.418.826
SMILESNC(CO)(CO)CO.OC(=O)CCn1c2cc(Cl)c(OC3CC3)cc2oc1=O