Reaction Details
TargetKynurenine 3-monooxygenase
LigandBDBM50238007
Substrate/Competitorn/a
Meas. Tech.ChEMBL_1662711 (CHEMBL4012392)
IC50 79±n/a nM
Citation Liddle, JBeaufils, BBinnie, MBouillot, ADenis, AAHann, MMHaslam, CPHolmes, DSHutchinson, JPKranz, MMcBride, AMirguet, OMole, DJMowat, CGPal, SRowland, PTrottet, LUings, IJWalker, ALWebster, SP The discovery of potent and selective kynurenine 3-monooxygenase inhibitors for the treatment of acute pancreatitis. Bioorg Med Chem Lett27:2023-2028 (2017) 
 
Kynurenine 3-monooxygenase
Name:Kynurenine 3-monooxygenase
Type:PROTEIN
Mol. Mass.:55831.03
Organism:Homo sapiens (Human)
Description:ChEMBL_1487479
Residue:486
BDBM50238007
NameBDBM50238007
Synonyms:CHEMBL4100173
TypeSmall organic molecule
Emp. Form.C11H10ClNO4
Mol. Mass.255.654
SMILESOC(=O)CCN1C(=O)COc2ccc(Cl)cc12