Reaction Details
TargetKynurenine 3-monooxygenase
LigandBDBM50238012
Substrate/Competitorn/a
Meas. Tech.ChEMBL_1662711 (CHEMBL4012392)
IC50 100±n/a nM
Citation Liddle, JBeaufils, BBinnie, MBouillot, ADenis, AAHann, MMHaslam, CPHolmes, DSHutchinson, JPKranz, MMcBride, AMirguet, OMole, DJMowat, CGPal, SRowland, PTrottet, LUings, IJWalker, ALWebster, SP The discovery of potent and selective kynurenine 3-monooxygenase inhibitors for the treatment of acute pancreatitis. Bioorg Med Chem Lett27:2023-2028 (2017) 
 
Kynurenine 3-monooxygenase
Name:Kynurenine 3-monooxygenase
Type:PROTEIN
Mol. Mass.:55831.03
Organism:Homo sapiens (Human)
Description:ChEMBL_1487479
Residue:486
BDBM50238012
NameBDBM50238012
Synonyms:CHEMBL4095901
TypeSmall organic molecule
Emp. Form.C9H7ClN2O2
Mol. Mass.210.617
SMILESOC(=O)Cn1ncc2ccc(Cl)cc12