Reaction Details
TargetKynurenine 3-monooxygenase
LigandBDBM50237998
Substrate/Competitorn/a
Meas. Tech.ChEMBL_1662735 (CHEMBL4012416)
IC50 6.0±n/a nM
Citation Liddle, JBeaufils, BBinnie, MBouillot, ADenis, AAHann, MMHaslam, CPHolmes, DSHutchinson, JPKranz, MMcBride, AMirguet, OMole, DJMowat, CGPal, SRowland, PTrottet, LUings, IJWalker, ALWebster, SP The discovery of potent and selective kynurenine 3-monooxygenase inhibitors for the treatment of acute pancreatitis. Bioorg Med Chem Lett27:2023-2028 (2017) 
 
Kynurenine 3-monooxygenase
Name:Kynurenine 3-monooxygenase
Type:PROTEIN
Mol. Mass.:55831.03
Organism:Homo sapiens (Human)
Description:ChEMBL_1487479
Residue:486
BDBM50237998
NameBDBM50237998
Synonyms:CHEMBL1881960
TypeSmall organic molecule
Emp. Form.C7H3Cl2NO2
Mol. Mass.204.01
SMILESOc1nc2cc(Cl)c(Cl)cc2o1