Reaction Details
TargetKynurenine 3-monooxygenase
LigandBDBM50238019
Substrate/Competitorn/a
Meas. Tech.ChEMBL_1662712 (CHEMBL4012393)
IC50 1585±n/a nM
Citation Liddle, JBeaufils, BBinnie, MBouillot, ADenis, AAHann, MMHaslam, CPHolmes, DSHutchinson, JPKranz, MMcBride, AMirguet, OMole, DJMowat, CGPal, SRowland, PTrottet, LUings, IJWalker, ALWebster, SP The discovery of potent and selective kynurenine 3-monooxygenase inhibitors for the treatment of acute pancreatitis. Bioorg Med Chem Lett27:2023-2028 (2017) 
 
Kynurenine 3-monooxygenase
Name:Kynurenine 3-monooxygenase
Type:PROTEIN
Mol. Mass.:55831.03
Organism:Homo sapiens (Human)
Description:ChEMBL_1487479
Residue:486
BDBM50238019
NameBDBM50238019
Synonyms:CHEMBL4078673
TypeSmall organic molecule
Emp. Form.C17H25ClN2O8
Mol. Mass.420.842
SMILESNC(CO)(CO)CO.CC(C)Oc1cc2oc(=O)n(CCC(O)=O)c2cc1Cl