Reaction Details
TargetTGF-beta receptor type-1
LigandBDBM50238074
Substrate/Competitorn/a
Meas. Tech.ChEMBL_1662763 (CHEMBL4012444)
IC50 3.2±n/a nM
Citation Sabat, MWang, HScorah, NLawson, JDAtienza, JKamran, RHixon, MSDougan, DR Design, synthesis and optimization of 7-substituted-pyrazolo[4,3-b]pyridine ALK5 (activin receptor-like kinase 5) inhibitors. Bioorg Med Chem Lett27:1955-1961 (2017) 
 
TGF-beta receptor type-1
Name:TGF-beta receptor type-1
Type:enzyme
Mol. Mass.:55968.24
Organism:Homo sapiens (Human)
Description:P36897
Residue:503
BDBM50238074
NameBDBM50238074
Synonyms:CHEMBL4075003
TypeSmall organic molecule
Emp. Form.C21H19FN6O
Mol. Mass.390.4136
SMILESCc1ccc(F)c(c1)-c1cc(Nc2ccnc3cnn(CC(N)=O)c23)c(C)cn1