Reaction Details
TargetTGF-beta receptor type-1
LigandBDBM50238071
Substrate/Competitorn/a
Meas. Tech.ChEMBL_1662764 (CHEMBL4012445)
EC50 6.3±n/a nM
Citation Sabat, MWang, HScorah, NLawson, JDAtienza, JKamran, RHixon, MSDougan, DR Design, synthesis and optimization of 7-substituted-pyrazolo[4,3-b]pyridine ALK5 (activin receptor-like kinase 5) inhibitors. Bioorg Med Chem Lett27:1955-1961 (2017) 
 
TGF-beta receptor type-1
Name:TGF-beta receptor type-1
Type:enzyme
Mol. Mass.:55968.24
Organism:Homo sapiens (Human)
Description:P36897
Residue:503
BDBM50238071
NameBDBM50238071
Synonyms:CHEMBL4079857
TypeSmall organic molecule
Emp. Form.C20H18FN5
Mol. Mass.347.3888
SMILESCc1ccc(F)c(c1)-c1cc(Nc2ccnc3cnn(C)c23)c(C)cn1