Reaction Details
TargetTGF-beta receptor type-1
LigandBDBM50238058
Substrate/Competitorn/a
Meas. Tech.ChEMBL_1662764 (CHEMBL4012445)
EC50 20±n/a nM
Citation Sabat, MWang, HScorah, NLawson, JDAtienza, JKamran, RHixon, MSDougan, DR Design, synthesis and optimization of 7-substituted-pyrazolo[4,3-b]pyridine ALK5 (activin receptor-like kinase 5) inhibitors. Bioorg Med Chem Lett27:1955-1961 (2017) 
 
TGF-beta receptor type-1
Name:TGF-beta receptor type-1
Type:enzyme
Mol. Mass.:55968.24
Organism:Homo sapiens (Human)
Description:P36897
Residue:503
BDBM50238058
NameBDBM50238058
Synonyms:CHEMBL4087735
TypeSmall organic molecule
Emp. Form.C21H20FN5O
Mol. Mass.377.4148
SMILESCc1ccc(F)c(c1)-c1cc(Nc2ccnc3cnn(CCO)c23)c(C)cn1