Reaction Details
TargetTGF-beta receptor type-1
LigandBDBM50238073
Substrate/Competitorn/a
Meas. Tech.ChEMBL_1662764 (CHEMBL4012445)
EC50 100±n/a nM
Citation Sabat, MWang, HScorah, NLawson, JDAtienza, JKamran, RHixon, MSDougan, DR Design, synthesis and optimization of 7-substituted-pyrazolo[4,3-b]pyridine ALK5 (activin receptor-like kinase 5) inhibitors. Bioorg Med Chem Lett27:1955-1961 (2017) 
 
TGF-beta receptor type-1
Name:TGF-beta receptor type-1
Type:enzyme
Mol. Mass.:55968.24
Organism:Homo sapiens (Human)
Description:P36897
Residue:503
BDBM50238073
NameBDBM50238073
Synonyms:CHEMBL4066402
TypeSmall organic molecule
Emp. Form.C22H22FN5O
Mol. Mass.391.4414
SMILESC[C@@H](O)Cn1ncc2nccc(Nc3cc(ncc3C)-c3cc(C)ccc3F)c12