Reaction Details
TargetTGF-beta receptor type-1
LigandBDBM50238059
Substrate/Competitorn/a
Meas. Tech.ChEMBL_1662765 (CHEMBL4012446)
EC50 200±n/a nM
Citation Sabat, MWang, HScorah, NLawson, JDAtienza, JKamran, RHixon, MSDougan, DR Design, synthesis and optimization of 7-substituted-pyrazolo[4,3-b]pyridine ALK5 (activin receptor-like kinase 5) inhibitors. Bioorg Med Chem Lett27:1955-1961 (2017) 
 
TGF-beta receptor type-1
Name:TGF-beta receptor type-1
Type:enzyme
Mol. Mass.:55968.24
Organism:Homo sapiens (Human)
Description:P36897
Residue:503
BDBM50238059
NameBDBM50238059
Synonyms:CHEMBL4064820
TypeSmall organic molecule
Emp. Form.C17H11F2N5
Mol. Mass.323.2995
SMILESFc1ccc(F)c(c1)-c1cc(Nc2ccnc3cn[nH]c23)ccn1