Reaction Details
TargetTGF-beta receptor type-1
LigandBDBM50238075
Substrate/Competitorn/a
Meas. Tech.ChEMBL_1662765 (CHEMBL4012446)
EC50 1585±n/a nM
Citation Sabat, MWang, HScorah, NLawson, JDAtienza, JKamran, RHixon, MSDougan, DR Design, synthesis and optimization of 7-substituted-pyrazolo[4,3-b]pyridine ALK5 (activin receptor-like kinase 5) inhibitors. Bioorg Med Chem Lett27:1955-1961 (2017) 
 
TGF-beta receptor type-1
Name:TGF-beta receptor type-1
Type:enzyme
Mol. Mass.:55968.24
Organism:Homo sapiens (Human)
Description:P36897
Residue:503
BDBM50238075
NameBDBM50238075
Synonyms:CHEMBL4103188
TypeSmall organic molecule
Emp. Form.C22H21FN6O
Mol. Mass.404.4401
SMILESCNC(=O)Cn1ncc2nccc(Nc3cc(ncc3C)-c3cc(C)ccc3F)c12