Reaction Details
TargetTGF-beta receptor type-1
LigandBDBM50238084
Substrate/Competitorn/a
Meas. Tech.ChEMBL_1662763 (CHEMBL4012444)
IC50 3.2±n/a nM
Citation Sabat, MWang, HScorah, NLawson, JDAtienza, JKamran, RHixon, MSDougan, DR Design, synthesis and optimization of 7-substituted-pyrazolo[4,3-b]pyridine ALK5 (activin receptor-like kinase 5) inhibitors. Bioorg Med Chem Lett27:1955-1961 (2017) 
 
TGF-beta receptor type-1
Name:TGF-beta receptor type-1
Type:enzyme
Mol. Mass.:55968.24
Organism:Homo sapiens (Human)
Description:P36897
Residue:503
BDBM50238084
NameBDBM50238084
Synonyms:CHEMBL4085333
TypeSmall organic molecule
Emp. Form.C21H19F2N5O
Mol. Mass.395.4053
SMILESCC(O)Cn1ncc2nccc(Nc3cc(ncc3C)-c3cc(F)ccc3F)c12