Reaction Details
TargetNeuronal acetylcholine receptor subunit alpha-2/beta-2
LigandBDBM50238584
Substrate/Competitorn/a
Meas. Tech.ChEMBL_1663459 (CHEMBL4013140)
IC50>10000±n/a nM
Citation Wu, YZhangsun, DZhu, XKaas, QZhangsun, MHarvey, PJCraik, DJMcIntosh, JMLuo, S a-Conotoxin [S9A]TxID Potently Discriminates betweena3ß4 anda6/a3ß4 Nicotinic Acetylcholine Receptors. J Med Chem60:5826-5833 (2017) 
 
Neuronal acetylcholine receptor subunit alpha-2/beta-2
Name:Neuronal acetylcholine receptor subunit alpha-2/beta-2
Type:n/a
Mol. Mass.:n/a
Description:ASSAY_ID of EBI is 143226
Components:This complex has 2 components.
Component 1
Name:Neuronal acetylcholine receptor subunit alpha-2
Synonyms:ACHA2_RAT Cholinergic, Nicotinic Alpha2Beta2 Chrna2
Type:Enzyme
Mol. Mass.:58597.25
Organism:Rattus norvegicus (Rat)
Description:P12389
Residue:511
Component 2
Name:Neuronal acetylcholine receptor subunit beta-2
Synonyms:ACHB2_RAT Chrnb2 Neuronal acetylcholine receptor non-alpha-1 chain
Type:Enzyme
Mol. Mass.:56910.32
Organism:Rattus norvegicus (Rat)
Description:P12390
Residue:500
BDBM50238584
NameBDBM50238584
Synonyms:CHEMBL4089797
TypeSmall organic molecule
Emp. Form.C59H94N18O17S5
Mol. Mass.1487.813
SMILESCC[C@H](C)[C@@H]1NC(=O)[C@@H]2CCCN2C(=O)[C@H](CO)NC(=O)[C@H](CCCSC)NC(=O)[C@H](C)NC(=O)[C@H](C)NC(=O)[C@@H]2CSSC[C@H](NC(=O)CN)C(=O)N[C@@H](CSSC[C@H](NC1=O)C(N)=O)C(=O)N[C@@H](CO)C(=O)N[C@@H](Cc1cnc[nH]1)C(=O)N1CCC[C@H]1C(=O)N[C@@H](C(C)C)C(=O)N2