Reaction Details
TargetNeuronal acetylcholine receptor subunit alpha-3/alpha-6/beta-4
LigandBDBM50238609
Substrate/Competitorn/a
Meas. Tech.ChEMBL_1663466 (CHEMBL4013147)
IC50 147±n/a nM
Citation Wu, YZhangsun, DZhu, XKaas, QZhangsun, MHarvey, PJCraik, DJMcIntosh, JMLuo, S a-Conotoxin [S9A]TxID Potently Discriminates betweena3ß4 anda6/a3ß4 Nicotinic Acetylcholine Receptors. J Med Chem60:5826-5833 (2017) 
 
Neuronal acetylcholine receptor subunit alpha-3/alpha-6/beta-4
Name:Neuronal acetylcholine receptor subunit alpha-3/alpha-6/beta-4
Synonyms:Nicotinic acetylcholine receptor alpha6/alpha3/beta4
Type:n/a
Mol. Mass.:n/a
Description:ASSAY_ID of ChEMBL is 2103200
Components:This complex has 3 components.
Component 1
Name:Neuronal acetylcholine receptor subunit alpha-3
Type:Enzyme
Mol. Mass.:56995.52
Organism:Rattus norvegicus (Rat)
Description:P04757
Residue:499
Component 2
Name:Neuronal acetylcholine receptor subunit beta-4
Synonyms:ACHB4_RAT Chrnb4 Neuronal acetylcholine receptor non-alpha-2 chain | Neuronal acetylcholine receptor protein beta-4 subunit
Type:Enzyme
Mol. Mass.:55863.89
Organism:Rattus norvegicus (Rat)
Description:P12392
Residue:495
Component 3
Name:Neuronal acetylcholine receptor subunit alpha-6
Synonyms:ACHA6_RAT Chrna6 Neuronal acetylcholine receptor subunit alpha-6 | Neuronal acetylcholine receptor subunit alpha-6/beta-3
Type:PROTEIN
Mol. Mass.:56943.53
Organism:Rattus norvegicus
Description:ChEMBL_1454451
Residue:493
BDBM50238609
NameBDBM50238609
Synonyms:CHEMBL4100403
TypeSmall organic molecule
Emp. Form.C65H97N23O21S4
Mol. Mass.1664.867
SMILESCC[C@H](C)[C@@H]1NC(=O)[C@H](Cc2cnc[nH]2)NC(=O)[C@@H]2CCCN2C(=O)[C@H](CC(N)=O)NC(=O)[C@H](CC(N)=O)NC(=O)[C@@H](NC(=O)[C@H](CC(N)=O)NC(=O)[C@@H]2CSSC[C@H](NC(=O)[C@H](CSSC[C@@H](NC1=O)C(O)=O)NC(=O)CN)C(=O)N[C@@H](CO)C(=O)N[C@@H](Cc1c[nH]cn1)C(=O)N1CCC[C@H]1C(=O)N[C@@H](C)C(=O)N2)C(C)C