Reaction Details
TargetHistamine H2 receptor
LigandBDBM22913
Substrate/Competitorn/a
Ki 2280±n/a nM
CommentsPDSP_2292
Citation Leurs, RTulp, MTMenge, WMAdolfs, MJZuiderveld, OPTimmerman, H Evaluation of the receptor selectivity of the H3 receptor antagonists, iodophenpropit and thioperamide: an interaction with the 5-HT3 receptor revealed. Br J Pharmacol116:2315-21 (1995) 
 
Histamine H2 receptor
Name:Histamine H2 receptor
Type:G Protein-Coupled Receptor (GPCR)
Mol. Mass.:40567.22
Organism:Cavia porcellus (domestic guinea pig)
Description:For the H2 receptor-binding assays, guinea pig striatum was used.
Residue:359
BDBM22913
NameBDBM22913
Synonyms:CHEMBL1237146 Iodophenpropit | {[3-(1H-imidazol-5-yl)propyl]sulfanyl}-N''-[2-(4-iodophenyl)ethyl]methanimidamide
TypeSmall organic molecule
Emp. Form.C15H19IN4S
Mol. Mass.414.308
SMILESNC(SCCCc1cnc[nH]1)=NCCc1ccc(I)cc1