Reaction Details
TargetVasopressin V1b receptor
LigandBDBM85094
Substrate/Competitorn/a
Ki 25.1±n/a nM
CommentsPDSP_631
Citation Tahara, ATomura, YWada, KIKusayama, TTsukada, JTakanashi, MYatsu, TUchida, WTanaka, A Pharmacological profile of YM087, a novel potent nonpeptide vasopressin V1A and V2 receptor antagonist, in vitro and in vivo. J Pharmacol Exp Ther282:301-8 (1997) Vasopressin V1b receptor
Name:Vasopressin V1b receptor
Type:Enzyme Catalytic Domain
Mol. Mass.:47104.48
Organism:RAT
Description:VASOPRESSIN V1B AVPR1B RAT::P48974
Residue:425
BDBM85094
NameBDBM85094
Synonyms:CAS_62357-86-2 dDAVP
TypeSmall organic molecule
Emp. Form.C46H64N14O12S2
Mol. Mass.1069.217
SMILES[#7]-[#6](=O)-[#6]-[#6]-[#6]-1-[#7]-[#6](=O)-[#6](-[#6]-c2ccccc2)-[#7]-[#6](=O)-[#6](-[#6]-c2ccc(-[#8])cc2)-[#7]-[#6](=O)-[#6]-[#6]-[#16]-[#16]-[#6]-[#6](-[#7]-[#6](=O)-[#6](-[#6]-[#6](-[#7])=O)-[#7]-[#6]-1=O)-[#6](=O)-[#7]-1-[#6]-[#6]-[#6]-[#6]-1-[#6](=O)-[#7]-[#6](-[#6]-[#6]-[#6]\[#7]=[#6](\[#7])-[#7])-[#6](=O)-[#7]-[#6]-[#6](-[#7])=O