Reaction Details
TargetLysosomal acid glucosylceramidase
LigandBDBM85134
Substrate/Competitorn/a
Meas. Tech.Fluorescene-based Assay
pH5.5±0
Ki 0.2±0.01 nM
Citation Hill, TTropak, MBMahuran, DWithers, SG Synthesis, kinetic evaluation and cell-based analysis of C-alkylated isofagomines as chaperones of β-glucocerebrosidase. Chembiochem12:2151-4 (2011) 
 
Lysosomal acid glucosylceramidase
Name:Lysosomal acid glucosylceramidase
Type:Enzyme
Mol. Mass.:59724.64
Organism:Homo sapiens (Human)
Description:The beta-Glu activity was measured with commercially available beta-glucocerebrosidase (Ceredase) as the enzyme source.
Residue:536
BDBM85134
NameBDBM85134
Synonyms:Isofagomine derivative, 7
TypeSmall organic molecule
Emp. Form.C15H31NO3
Mol. Mass.273.4115
SMILESCCCCCCCCCC1NCC(O)C(O)C1CO