Reaction Details
TargetGastrin/cholecystokinin type B receptor
LigandBDBM85146
Substrate/Competitorn/a
Ki 2951.21±n/a nM
CommentsPDSP_73
Citation Henke, BRAquino, CJBirkemo, LSCroom, DKDougherty, RWErvin, GNGrizzle, MKHirst, GCJames, MKJohnson, MFQueen, KLSherrill, RGSugg, EESuh, EMSzewczyk, JWUnwalla, RJYingling, JWillson, TM Optimization of 3-(1H-indazol-3-ylmethyl)-1,5-benzodiazepines as potent, orally active CCK-A agonists. J Med Chem40:2706-25 (1997) 
 
Gastrin/cholecystokinin type B receptor
Name:Gastrin/cholecystokinin type B receptor
Type:G Protein-Coupled Receptor (GPCR)
Mol. Mass.:48445.79
Organism:Homo sapiens (Human)
Description:Stable expression of human CCK-2 receptors in HEK 293 cells.
Residue:447
BDBM85146
NameBDBM85146
Synonyms:CCK-A Agonist 30
TypeSmall organic molecule
Emp. Form.C35H37N5O4
Mol. Mass.591.6994
SMILESCOc1ccc(cc1)N(C(C)C)C(=O)CN1c2ccccc2N(c2ccccc2)C(=O)C(Cc2[nH]nc3CCCCc23)C1=O