Reaction Details
Target5-hydroxytryptamine receptor 1A
LigandBDBM85190
Substrate/Competitorn/a
Ki 0.59±n/a nM
CommentsPDSP_1276
Citation Johansson, LSohn, DThorberg, SOJackson, DMKelder, DLarsson, LGRényi, LRoss, SBWallsten, CEriksson, HHu, PSJerning, EMohell, NWestlind-Danielsson, A The pharmacological characterization of a novel selective 5-hydroxytryptamine1A receptor antagonist, NAD-299. J Pharmacol Exp Ther283:216-25 (1997) 5-hydroxytryptamine receptor 1A
Name:5-hydroxytryptamine receptor 1A
Type:G Protein-Coupled Receptor (GPCR)
Mol. Mass.:46445.29
Organism:Rattus norvegicus (rat)
Description:Binding assays were performed using rat hippocampal membranes.
Residue:422
BDBM85190
NameBDBM85190
Synonyms:CAS_3055171 NSC_3055171
TypeSmall organic molecule
Emp. Form.C18H23FN2O2
Mol. Mass.318.3858
SMILESNC(=O)c1ccc(F)c2OCC(Cc12)N(C1CCC1)C1CCC1