Reaction Details
Target5-hydroxytryptamine receptor 1F
LigandBDBM85195
Substrate/Competitorn/a
Ki 6±n/a nM
CommentsPDSP_1150
Citation Phebus, LAJohnson, KWZgombick, JMGilbert, PJVan Belle, KMancuso, VNelson, DLCalligaro, DOKiefer, ADBranchek, TAFlaugh, ME Characterization of LY344864 as a pharmacological tool to study 5-HT1F receptors: binding affinities, brain penetration and activity in the neurogenic dural inflammation model of migraine. Life Sci61:2117-26 (1997) 
 
5-hydroxytryptamine receptor 1F
Name:5-hydroxytryptamine receptor 1F
Type:Enzyme Catalytic Domain
Mol. Mass.:41724.68
Organism:Homo sapiens (Human)
Description:5-HT1F HTR1F HUMAN::P30939
Residue:366
BDBM85195
NameBDBM85195
Synonyms:CAS_5311097 NSC_5311097
TypeSmall organic molecule
Emp. Form.C21H22FN3O
Mol. Mass.351.4173
SMILESCN(C)C1CCc2[nH]c3ccc(NC(=O)c4ccc(F)cc4)cc3c2C1