Reaction Details
Target5-hydroxytryptamine receptor 7
LigandBDBM10755
Substrate/Competitorn/a
Ki 6.31±n/a nM
CommentsPDSP_150
Citation Thomas, DRGittins, SACollin, LLMiddlemiss, DNRiley, GHagan, JGloger, IEllis, CEForbes, ITBrown, AM Functional characterisation of the human cloned 5-HT7 receptor (long form); antagonist profile of SB-258719. Br J Pharmacol124:1300-6 (1998) 
 
5-hydroxytryptamine receptor 7
Name:5-hydroxytryptamine receptor 7
Type:G Protein-Coupled Receptor (GPCR)
Mol. Mass.:53573.08
Organism:Homo sapiens (Human)
Description:P34969
Residue:479
BDBM10755
NameBDBM10755
Synonyms:14C-5-hydroxy tryptamine creatinine disulfate 5-HT 5-hydroxy tryptamine creatinine disulfate Serotonin | [3H]-5-HT
TypeSmall organic molecule
Emp. Form.C10H12N2O
Mol. Mass.176.2151
SMILESNCCc1c[nH]c2ccc(O)cc12