Reaction Details
Target5-hydroxytryptamine receptor 7
LigandBDBM50024204
Substrate/Competitorn/a
Ki 31.63±n/a nM
CommentsPDSP_1206
Citation Thomas, DRGittins, SACollin, LLMiddlemiss, DNRiley, GHagan, JGloger, IEllis, CEForbes, ITBrown, AM Functional characterisation of the human cloned 5-HT7 receptor (long form); antagonist profile of SB-258719. Br J Pharmacol124:1300-6 (1998) 
 
5-hydroxytryptamine receptor 7
Name:5-hydroxytryptamine receptor 7
Type:G Protein-Coupled Receptor (GPCR)
Mol. Mass.:53573.08
Organism:Homo sapiens (Human)
Description:P34969
Residue:479
BDBM50024204
NameBDBM50024204
Synonyms:1H-imidazo[4,5-c]pyridine derivative 4,7-dimethyl-(6aR,9S,10aR)-4,6,6a,7,8,9,10,10a-octahydroindolo[4,3-fg]quinolin-9-amino-N,N-dimethyl sulfonamide 9-N,N-dimethylsulfamide-4,7-dimethyl-4,6,6a,7,8,9,10,10a-octahydro-indolo[4,3-fg]quinoline ChEMBL_10959 N'-4,7-Dimethyl-4,6,6a,7,8,9,10,10a-octahydro-indolo[4,3-fg]quinolin-9-yl)-N'-,N'-dimethyl-sulphonediamine
TypeSmall organic molecule
Emp. Form.C18H26N4O2S
Mol. Mass.362.49
SMILESCN(C)S(=O)(=O)N[C@H]1C[C@H]2[C@@H](Cc3cn(C)c4cccc2c34)N(C)C1