Reaction Details
TargetSomatostatin receptor type 2
LigandBDBM50064778
Substrate/Competitorn/a
Ki 0.49±n/a nM
CommentsPDSP_7579
Citation Yang, LBerk, SCRohrer, SPMosley, RTGuo, LUnderwood, DJArison, BHBirzin, ETHayes, ECMitra, SWParmar, RMCheng, KWu, TJButler, BSFoor, FPasternak, APan, YSilva, MFreidinger, RMSmith, RGChapman, KSchaeffer, JMPatchett, AA Synthesis and biological activities of potent peptidomimetics selective for somatostatin receptor subtype 2. Proc Natl Acad Sci U S A95:10836-41 (1998) 
 
Somatostatin receptor type 2
Name:Somatostatin receptor type 2
Type:Enzyme
Mol. Mass.:41344.94
Organism:Homo sapiens (Human)
Description:P30874
Residue:369
BDBM50064778
NameBDBM50064778
Synonyms:(5S,8R,11R,14R,17R,19aR)-11-(4-Amino-butyl)-17-benzyl-5-(4-hydroxy-benzyl)-14-(1-hydroxy-ethyl)-8-(1H-indol-3-ylmethyl)-tetradecahydro-3a,6,9,12,15,18-hexaaza-cyclopentacyclooctadecene-4,7,10,13,16,19-hexaone L-363,377 | L-363377
TypeSmall organic molecule
Emp. Form.C44H54N8O8
Mol. Mass.822.9484
SMILESCC(O)[C@H]1NC(=O)[C@@H](Cc2ccccc2)NC(=O)[C@H]2CCCN2C(=O)[C@H](Cc2ccc(O)cc2)NC(=O)[C@@H](Cc2c[nH]c3ccccc23)NC(=O)[C@@H](CCCCN)NC1=O