Reaction Details
TargetSomatostatin receptor type 5
LigandBDBM81766
Substrate/Competitorn/a
Ki 232±n/a nM
CommentsPDSP_1242
Citation Yang, LBerk, SCRohrer, SPMosley, RTGuo, LUnderwood, DJArison, BHBirzin, ETHayes, ECMitra, SWParmar, RMCheng, KWu, TJButler, BSFoor, FPasternak, APan, YSilva, MFreidinger, RMSmith, RGChapman, KSchaeffer, JMPatchett, AA Synthesis and biological activities of potent peptidomimetics selective for somatostatin receptor subtype 2. Proc Natl Acad Sci U S A95:10836-41 (1998) 
 
Somatostatin receptor type 5
Name:Somatostatin receptor type 5
Type:Enzyme
Mol. Mass.:39218.02
Organism:Homo sapiens (Human)
Description:P35346
Residue:364
BDBM81766
NameBDBM81766
Synonyms:CAS_3086456 NSC_3086456
TypeSmall organic molecule
Emp. Form.C44H56N8O7
Mol. Mass.808.9648
SMILESCC(C)C1NC(=O)C(CCCCN)NC(=O)C(Cc2c[nH]c3ccccc23)NC(=O)C(Cc2ccc(O)cc2)NC(=O)C(C)N(C)C(=O)C(Cc2ccccc2)NC1=O