Reaction Details
TargetVasopressin V1a receptor
LigandBDBM35723
Substrate/Competitorn/a
Ki 12.3±n/a nM
CommentsPDSP_1417
Citation Yamamura, YNakamura, SItoh, SHirano, TOnogawa, TYamashita, TYamada, YTsujimae, KAoyama, MKotosai, KOgawa, HYamashita, HKondo, KTominaga, MTsujimoto, GMori, T OPC-41061, a highly potent human vasopressin V2-receptor antagonist: pharmacological profile and aquaretic effect by single and multiple oral dosing in rats. J Pharmacol Exp Ther287:860-7 (1998) Vasopressin V1a receptor
Name:Vasopressin V1a receptor
Type:Receptor
Mol. Mass.:46820.18
Organism:Homo sapiens (Human)
Description:P37288
Residue:418
BDBM35723
NameBDBM35723
Synonyms:CHEMBL344159 TOLVAPTAN | benzazepine derivative, 32
TypeSmall organic molecule
Emp. Form.C26H25ClN2O3
Mol. Mass.448.941
SMILESCc1ccccc1C(=O)Nc1ccc(C(=O)N2CCCC(O)c3cc(Cl)ccc23)c(C)c1