Reaction Details
TargetGamma-aminobutyric acid receptor subunit alpha-1
LigandBDBM26263
Substrate/Competitorn/a
Ki 1.52±n/a nM
CommentsPDSP_827
Citation Renard, SOlivier, AGranger, PAvenet, PGraham, DSevrin, MGeorge, PBesnard, F Structural elements of the gamma-aminobutyric acid type A receptor conferring subtype selectivity for benzodiazepine site ligands. J Biol Chem274:13370-4 (1999) 
 
Gamma-aminobutyric acid receptor subunit alpha-1
Name:Gamma-aminobutyric acid receptor subunit alpha-1
Type:Enzyme
Mol. Mass.:51770.21
Organism:Rattus norvegicus (Rat)
Description:P62813
Residue:455
BDBM26263
NameBDBM26263
Synonyms:Anexate FLUMAZENIL Romazicon ethyl 12-fluoro-8-methyl-9-oxo-2,4,8-triazatricyclo[8.4.0.0^{2,6}]tetradeca-1(14),3,5,10,12-pentaene-5-carboxylate
TypeSmall organic molecule
Emp. Form.C15H14FN3O3
Mol. Mass.303.2884
SMILESCCOC(=O)c1ncn-2c1CN(C)C(=O)c1cc(F)ccc-21