Reaction Details
TargetNeutrophil elastase
LigandBDBM85465
Substrate/Competitorn/a
Meas. Tech.Enzyme Assay
Temperature298.15±n/a K
Ki 1.99e+5± 3.4e+4 nM
Commentsextracted
Citation Vicentini, CBGuarneri, MAndrisano, VGuccione, SLanger, TMarschhofer, RChabin, REdison, AMHuang, XKnight, WBGiori, P Potential of pyrazolooxadiazinone derivatives as serine protease inhibitors. J Enzym Inhib16:15-34 (2001) 
 
Neutrophil elastase
Name:Neutrophil elastase
Type:Enzyme
Mol. Mass.:28532.38
Organism:Homo sapiens (Human)
Description:P08246
Residue:267
BDBM85465
NameBDBM85465
Synonyms:Pyrazolooxadiazinone, 2j
TypeSmall organic molecule
Emp. Form.C7H10N4O2
Mol. Mass.182.1799
SMILESCCc1nn(C)c2NC(=O)ONc12