Reaction Details
Target5-hydroxytryptamine receptor 3A
LigandBDBM85330
Substrate/Competitorn/a
Ki 3.98±n/a nM
CommentsPDSP_890
Citation Millan, MJNewman-Tancredi, AAudinot, VCussac, DLejeune, FNicolas, JPCogé, FGalizzi, JPBoutin, JARivet, JMDekeyne, AGobert, A Agonist and antagonist actions of yohimbine as compared to fluparoxan at alpha(2)-adrenergic receptors (AR)s, serotonin (5-HT)(1A), 5-HT(1B), 5-HT(1D) and dopamine D(2) and D(3) receptors. Significance for the modulation of frontocortical monoaminergic transmission and depressive states. Synapse35:79-95 (2000) 
 
5-hydroxytryptamine receptor 3A
Name:5-hydroxytryptamine receptor 3A
Type:n/a
Mol. Mass.:56056.00
Organism:Mus musculus (house mouse)
Description:5HT3A
Residue:487
BDBM85330
NameBDBM85330
Synonyms:CAS_68647 ONDANSETRON | Ondansetron hydrochloride
TypeSmall organic molecule
Emp. Form.C18H19N3O
Mol. Mass.293.363
SMILESCc1nccn1CC1CCc2c(C1=O)c1ccccc1n2C