Reaction Details
TargetHistamine H3 receptor
LigandBDBM22542
Substrate/Competitorn/a
Ki 1.6±n/a nM
CommentsPDSP_974
Citation Lovenberg, TWPyati, JChang, HWilson, SJErlander, MG Cloning of rat histamine H(3) receptor reveals distinct species pharmacological profiles. J Pharmacol Exp Ther293:771-8 (2000) Histamine H3 receptor
Name:Histamine H3 receptor
Type:G Protein-Coupled Receptor (GPCR)
Mol. Mass.:48691.47
Organism:Homo sapiens (Human)
Description:Binding assays were using CHO cells stably expressing hH3R receptors.
Residue:445
BDBM22542
NameBDBM22542
Synonyms:4-(1H-imidazol-4-ylmethyl)piperidine Immepip
TypeSmall organic molecule
Emp. Form.C9H15N3
Mol. Mass.165.2355
SMILESC(C1CCNCC1)c1cnc[nH]1