Reaction Details
TargetAlpha-2A adrenergic receptor
LigandBDBM50016897
Substrate/Competitorn/a
Ki 85.11±n/a nM
CommentsPDSP_544
Citation Brink, CBWade, SMNeubig, RR Agonist-directed trafficking of porcine alpha(2A)-adrenergic receptor signaling in Chinese hamster ovary cells: l-isoproterenol selectively activates G(s). J Pharmacol Exp Ther294:539-47 (2000) Alpha-2A adrenergic receptor
Name:Alpha-2A adrenergic receptor
Type:Enzyme Catalytic Domain
Mol. Mass.:48998.96
Organism:PIG
Description:adrenergic Alpha2 0 PIG::P18871
Residue:450
BDBM50016897
NameBDBM50016897
Synonyms:2-(2,6-dichloroanilino)-1,3-diazacyclopentene-(2) CLONIDINE clonidine (amino form)
TypeSmall organic molecule
Emp. Form.C9H9Cl2N3
Mol. Mass.230.094
SMILESClc1cccc(Cl)c1\[#7]=[#6]-1\[#7]-[#6]-[#6]-[#7]-1