Reaction Details
TargetAlpha-2A adrenergic receptor
LigandBDBM30712
Substrate/Competitorn/a
Ki 35.48±n/a nM
CommentsPDSP_1428
Citation Brink, CBWade, SMNeubig, RR Agonist-directed trafficking of porcine alpha(2A)-adrenergic receptor signaling in Chinese hamster ovary cells: l-isoproterenol selectively activates G(s). J Pharmacol Exp Ther294:539-47 (2000) Alpha-2A adrenergic receptor
Name:Alpha-2A adrenergic receptor
Type:Enzyme Catalytic Domain
Mol. Mass.:48998.96
Organism:PIG
Description:adrenergic Alpha2 0 PIG::P18871
Residue:450
BDBM30712
NameBDBM30712
Synonyms:6-tert-butyl-3-(2-imidazolin-2-ylmethyl)-2,4-dimethyl-phenol;hydrochloride 6-tert-butyl-3-(4,5-dihydro-1H-imidazol-2-ylmethyl)-2,4-dimethylphenol;hydrochloride Oxymetazoline cid_66259
TypeSmall organic molecule
Emp. Form.C16H24N2O
Mol. Mass.260.3746
SMILESCc1cc(c(O)c(C)c1CC1=NCCN1)C(C)(C)C